Target
Prothrombin
Ligand
BDBM50009961
Substrate
Meas. Tech.
ChEMBL_1342911 (CHEMBL3259186)
Ki
11600±n/a nM
Citation
 Tidwell, RRGeratz, JDDann, OVolz, GZeh, DLoewe, H Diarylamidine derivatives with one or both of the aryl moieties consisting of an indole or indole-like ring. Inhibitors of arginine-specific esteroproteases. J Med Chem 21:613-23 (1978)  
Target
Name:
Prothrombin
Synonyms:
Activation peptide fragment 1 Coagulation factor II Prothrombin Thrombin Thrombin light chain
Type:
Enzyme
Mol. Mass.:
70502.73
Organism:
Bos taurus (Bovine)
Description:
P00735
Residue:
625
  
Inhibitor
Name:
BDBM50009961
Synonyms:
CHEMBL356487
Type:
Small organic molecule
Emp. Form.:
C18H18N8
Mol. Mass.:
346.3891
SMILES:
NC(=N)c1ccc2[nH]c(CCc3nc4cc(ccc4[nH]3)C(N)=N)nc2c1
: