Target
Sodium-dependent serotonin transporter
Ligand
BDBM50005246
Substrate
Meas. Tech.
ChEMBL_1340419 (CHEMBL3253107)
IC50
45000±n/a nM
Citation
 Carnmalm, BRämsby, SRenyi, ALRoss, SBOgren, SO Antidepressant agents. 9. 3,3-Diphenylcyclobutylamines, a new class of central stimulants. J Med Chem 21:78-82 (1978)  
Target
Name:
Sodium-dependent serotonin transporter
Synonyms:
5-HT Transporter 5HTT SC6A4_MOUSE Sert Sodium-dependent serotonin transporter | Solute carrier family 6 member 4
Type:
Enzyme Catalytic Domain
Mol. Mass.:
70044.92
Organism:
MOUSE
Description:
5-HT Transporter SLC6A4 MOUSE::Q60857
Residue:
630
  
Inhibitor
Name:
BDBM50005246
Synonyms:
1-Phenylpropan-2-amin 1-phenylpropan-2-amine AMPHETAMINE Amfetamine DEXTROAMP SACCHARATE alpha-methylphenylethylamine beta-Phenylisopropylamin beta-phenylisopropylamine | desoxynorephedrine
Type:
Small organic molecule
Emp. Form.:
C9H13N
Mol. Mass.:
135.2062
SMILES:
CC(N)Cc1ccccc1
: