Target
5-hydroxytryptamine receptor 1A
Ligand
BDBM50010505
Substrate
Meas. Tech.
ChEMBL_1353507 (CHEMBL3269843)
Ki
2.6±n/a nM
Citation
 Liégeois, JFLespagnard, MMeneses Salas, EMangin, FScuvée-Moreau, JDilly, S Enhancing a CH-? Interaction to Increase the Affinity for 5-HT1A Receptors. ACS Med Chem Lett 5:358-62 (2014)  
Target
Name:
5-hydroxytryptamine receptor 1A
Synonyms:
5-HT-1A 5-hydroxytryptamine receptor 1A (5-HT-1A) ADRB2RL1 Dopamine D2 receptor and serotonin 1a receptor HTR1A | Serotonin receptor 1A
Type:
Mol. Mass.:
46122.49
Organism:
Homo sapiens (Human)
Description:
Residue:
422
  
Inhibitor
Name:
BDBM50010505
Synonyms:
CHEMBL3264372
Type:
Small organic molecule
Emp. Form.:
C22H20F2N4O
Mol. Mass.:
394.4172
SMILES:
Fc1cc(F)cc(c1)C1=CCN(CCNC(=O)c2cnc3ccccc3n2)CC1
: