Target
Adenosine receptor A2a
Ligand
BDBM50011294
Substrate
Meas. Tech.
ChEMBL_1352083 (CHEMBL3267348)
Ki
5.0±n/a nM
Citation
 de Lera Ruiz, MLim, YHZheng, J Adenosine A2A receptor as a drug discovery target. J Med Chem 57:3623-50 (2014)  
Target
Name:
Adenosine receptor A2a
Synonyms:
A2A adenosine receptor (hA2A) ADENOSINE A2 ADORA2 Adenosine A2A receptor (A2AAR)
Type:
G Protein-Coupled Receptor (GPCR)
Mol. Mass.:
44716.46
Organism:
Homo sapiens (Human)
Description:
P29274
Residue:
412
  
Inhibitor
Name:
BDBM50011294
Synonyms:
A2A Ro-4494351-002 SYN-115 | TOZADENANT
Type:
Small organic molecule
Emp. Form.:
C19H26N4O4S
Mol. Mass.:
406.499
SMILES:
COc1ccc(N2CCOCC2)c2sc(NC(=O)N3CCC(C)(O)CC3)nc12
: