Target
Cannabinoid receptor 1
Ligand
BDBM50011310
Substrate
Meas. Tech.
ChEMBL_1352142 (CHEMBL3267751)
Ki
4.2±n/a nM
Citation
 Ellsworth, BASher, PMWu, XWu, GSulsky, RBGu, ZMurugesan, NZhu, YYu, GSitkoff, DFCarlson, KEKang, LYang, YLee, NBaska, RAKeim, WJCullen, MJAzzara, AVZuvich, EThomas, MARohrbach, KWDevenny, JJGodonis, HEHarvey, SJMurphy, BJEverlof, GGStetsko, PIGudmundsson, OJohnghar, SRanasinghe, ABehnia, KPelleymounter, MAEwing, WR Reductions in log P improved protein binding and clearance predictions enabling the prospective design of cannabinoid receptor (CB1) antagonists with desired pharmacokinetic properties. J Med Chem 56:9586-600 (2014)  
Target
Name:
Cannabinoid receptor 1
Synonyms:
CANN6 CB-R CNR CNR1_HUMAN Cannabinoid receptor Cannabinoid receptor 1 (brain)
Type:
G Protein-Coupled Receptor (GPCR)
Mol. Mass.:
52868.96
Organism:
Homo sapiens (Human)
Description:
P21554
Residue:
472
  
Inhibitor
Name:
BDBM50011310
Synonyms:
CHEMBL3260737
Type:
Small organic molecule
Emp. Form.:
C32H20ClN7O2
Mol. Mass.:
570
SMILES:
Clc1ccc(cc1)-c1c(-c2ccncc2)c2nn(Cc3ccc(cc3)C#N)c(=O)n2n(Cc2ccc(cc2)C#N)c1=O
: