Target
Nuclear receptor ROR-alpha
Ligand
BDBM50012124
Substrate
Meas. Tech.
ChEMBL_1351788 (CHEMBL3270939)
EC50
3800±n/a nM
Citation
 Fauber, BPRené, OBurton, BEverett, CGobbi, AHawkins, JJohnson, ARLiimatta, MLockey, PNorman, MWong, H Identification of tertiary sulfonamides as RORc inverse agonists. Bioorg Med Chem Lett 24:2182-7 (2014)  
Target
Name:
Nuclear receptor ROR-alpha
Synonyms:
NR1F1 Nuclear receptor subfamily 1 group F member 1 RORA RZRA | Retinoid-related orphan receptor-alpha
Type:
PROTEIN
Mol. Mass.:
58976.26
Organism:
Homo sapiens (Human)
Description:
ChEMBL_101591
Residue:
523
  
Inhibitor
Name:
BDBM50012124
Synonyms:
CHEMBL3263714
Type:
Small organic molecule
Emp. Form.:
C25H30N2O4S2
Mol. Mass.:
486.647
SMILES:
CC(C)CN(Cc1ccc(cc1)-c1ccc(NS(C)(=O)=O)cc1)S(=O)(=O)Cc1ccccc1
: