Target
Nuclear receptor ROR-alpha
Ligand
BDBM50012126
Substrate
Meas. Tech.
ChEMBL_1351788 (CHEMBL3270939)
EC50
>10000±n/a nM
Citation
 Fauber, BPRené, OBurton, BEverett, CGobbi, AHawkins, JJohnson, ARLiimatta, MLockey, PNorman, MWong, H Identification of tertiary sulfonamides as RORc inverse agonists. Bioorg Med Chem Lett 24:2182-7 (2014)  
Target
Name:
Nuclear receptor ROR-alpha
Synonyms:
NR1F1 Nuclear receptor subfamily 1 group F member 1 RORA RZRA | Retinoid-related orphan receptor-alpha
Type:
PROTEIN
Mol. Mass.:
58976.26
Organism:
Homo sapiens (Human)
Description:
ChEMBL_101591
Residue:
523
  
Inhibitor
Name:
BDBM50012126
Synonyms:
CHEMBL3263716
Type:
Small organic molecule
Emp. Form.:
C25H28N2O3S
Mol. Mass.:
436.566
SMILES:
CC(C)CN(Cc1ccc(cc1)-c1ccc(cc1)C(N)=O)S(=O)(=O)Cc1ccccc1
: