Target
Nuclear receptor ROR-gamma
Ligand
BDBM50012135
Substrate
Meas. Tech.
ChEMBL_1351784 (CHEMBL3270935)
EC50
>10000±n/a nM
Citation
 Fauber, BPRené, OBurton, BEverett, CGobbi, AHawkins, JJohnson, ARLiimatta, MLockey, PNorman, MWong, H Identification of tertiary sulfonamides as RORc inverse agonists. Bioorg Med Chem Lett 24:2182-7 (2014)  
Target
Name:
Nuclear receptor ROR-gamma
Synonyms:
NR1F3 Nuclear receptor ROR-gamma (RORC) RAR-related orphan receptor C (RORc) RORG RZRG Retinoid-related orphan receptor-gamma (RORc)
Type:
Enzyme Catalytic Domain
Mol. Mass.:
58218.40
Organism:
Homo sapiens (Human)
Description:
P51449
Residue:
518
  
Inhibitor
Name:
BDBM50012135
Synonyms:
CHEMBL3263701
Type:
Small organic molecule
Emp. Form.:
C25H30N2O3S2
Mol. Mass.:
470.647
SMILES:
CC(C)CN(Cc1ccc(s1)-c1ccc(cc1)C(=O)N(C)C)S(=O)(=O)Cc1ccccc1
: