Target
Nuclear receptor ROR-alpha
Ligand
BDBM50012263
Substrate
Meas. Tech.
ChEMBL_1351230 (CHEMBL3271685)
IC50
10300±n/a nM
Citation
 Nishiyama, YNakamura, MMisawa, TNakagomi, MMakishima, MIshikawa, MHashimoto, Y Structure-activity relationship-guided development of retinoic acid receptor-related orphan receptor gamma (ROR¿)-selective inverse agonists with a phenanthridin-6(5H)-one skeleton from a liver X receptor ligand. Bioorg Med Chem 22:2799-808 (2014)  
Target
Name:
Nuclear receptor ROR-alpha
Synonyms:
NR1F1 Nuclear receptor subfamily 1 group F member 1 RORA RZRA | Retinoid-related orphan receptor-alpha
Type:
PROTEIN
Mol. Mass.:
58976.26
Organism:
Homo sapiens (Human)
Description:
ChEMBL_101591
Residue:
523
  
Inhibitor
Name:
BDBM50012263
Synonyms:
CHEMBL3259997
Type:
Small organic molecule
Emp. Form.:
C23H29NO
Mol. Mass.:
335.4825
SMILES:
CCCCCCc1ccc2n(CCCC)c(=O)c3ccccc3c2c1
: