Target
Macrophage migration inhibitory factor
Ligand
BDBM50186434
Substrate
Meas. Tech.
ChEMBL_1351718 (CHEMBL3270118)
IC50
14410±n/a nM
Citation
 Xu, LZhang, YZheng, LQiao, CLi, YLi, DZhen, XHou, T Discovery of novel inhibitors targeting the macrophage migration inhibitory factor via structure-based virtual screening and bioassays. J Med Chem 57:3737-45 (2014)  
Target
Name:
Macrophage migration inhibitory factor
Synonyms:
GIF Glycosylation-inhibiting factor L-dopachrome tautomerase MIF/CD74 (Macrophage migration inhibitory factor and HLA-DR antigens-associated invariant chain) MMIF Macrophage migration inhibitory factor (MIF) | Phenylpyruvate tautomerase
Type:
Enzyme
Mol. Mass.:
12478.18
Organism:
Homo sapiens (Human)
Description:
P14174
Residue:
115
  
Inhibitor
Name:
BDBM50186434
Synonyms:
(R)-methyl 2-(3-(4-hydroxyphenyl)-4,5-dihydroisoxazol-5-yl)acetate CHEMBL211769
Type:
Small organic molecule
Emp. Form.:
C12H13NO4
Mol. Mass.:
235.2359
SMILES:
COC(=O)C[C@H]1CC(=NO1)c1ccc(O)cc1
: