Target
Carbonic anhydrase 2
Ligand
BDBM50013792
Substrate
Meas. Tech.
ChEMBL_1349400 (CHEMBL3269990)
Ki
50±n/a nM
Citation
 Nasr, GCristian, ABarboiu, MVullo, DWinum, JYSupuran, CT Carbonic anhydrase inhibitors. Inhibition of human cytosolic isoforms I and II with (reduced) Schiff's bases incorporating sulfonamide, carboxylate and carboxymethyl moieties. Bioorg Med Chem 22:2867-74 (2014)  
Target
Name:
Carbonic anhydrase 2
Synonyms:
CA-II CAC Carbonate dehydratase II Carbonic anhydrase 2 (CA-II) Carbonic anhydrase C Carbonic anhydrase II (CA-II) Carbonic anhydrase II (hCA II) | Carbonic anhydrase isoenzyme II (hCA II)
Type:
Enzyme
Mol. Mass.:
29250.71
Organism:
Homo sapiens (Human)
Description:
P00918
Residue:
260
  
Inhibitor
Name:
BDBM50013792
Synonyms:
CHEBI:6822 Neptazane
Type:
Small organic molecule
Emp. Form.:
C5H8N4O3S2
Mol. Mass.:
236.272
SMILES:
CC(=O)\N=c1\sc(nn1C)S(N)(=O)=O
: