Target
Discoidin domain-containing receptor 2
Ligand
BDBM25115
Substrate
Meas. Tech.
ChEMBL_1350711 (CHEMBL3265735)
IC50
24±n/a nM
Citation
 Richters, ANguyen, HDPhan, TSimard, JRGrütter, CEngel, JRauh, D Identification of type II and III DDR2 inhibitors. J Med Chem 57:4252-62 (2014)  
Target
Name:
Discoidin domain-containing receptor 2
Synonyms:
DDR2 Discoidin domain receptor 2 (DDR2) Discoidin domain-containing receptor 2 (DDR2) NTRKR3 TYRO10
Type:
Protein
Mol. Mass.:
96717.07
Organism:
Homo sapiens (Human)
Description:
Q16832
Residue:
855
  
Inhibitor
Name:
BDBM25115
Synonyms:
3-[(4-bromo-2,6-difluorophenyl)methoxy]-5-({[4-(pyrrolidin-1-yl)butyl]carbamoyl}amino)-1,2-thiazole-4-carboxamide CP 547632 US9446026, 1
Type:
Small organic molecule
Emp. Form.:
C20H24BrF2N5O3S
Mol. Mass.:
532.402
SMILES:
NC(=O)c1c(NC(=O)NCCCCN2CCCC2)snc1OCc1c(F)cc(Br)cc1F
: