Target
Thymidylate synthase
Ligand
BDBM50016791
Substrate
Meas. Tech.
ChEMBL_1357879 (CHEMBL3285766)
IC50
5000±n/a nM
Citation
 Chaykovsky, MHirst, MLazarus, HMartinelli, JE Methotrexate analogues. 9. Synthesis and biological properties of some 8-alkyl-7,8-dihydro analogues. J Med Chem 20:1323-7 (1977)  
Target
Name:
Thymidylate synthase
Synonyms:
TSase Thymidylate Synthase (TS) thyA
Type:
Enzyme
Mol. Mass.:
36576.54
Organism:
Lactobacillus casei
Description:
Residue:
316
  
Inhibitor
Name:
BDBM50016791
Synonyms:
CHEMBL3273855
Type:
Small organic molecule
Emp. Form.:
C20H26N8O5
Mol. Mass.:
458.471
SMILES:
CN(CC1CNc2nc(N)nc(N)c2N1)c1ccc(cc1)C(=O)N[C@@H](CCC(O)=O)C(O)=O
: