Target
Thymidylate synthase
Ligand
BDBM50016796
Substrate
Meas. Tech.
ChEMBL_1357879 (CHEMBL3285766)
IC50
8000±n/a nM
Citation
 Chaykovsky, MHirst, MLazarus, HMartinelli, JE Methotrexate analogues. 9. Synthesis and biological properties of some 8-alkyl-7,8-dihydro analogues. J Med Chem 20:1323-7 (1977)  
Target
Name:
Thymidylate synthase
Synonyms:
TSase Thymidylate Synthase (TS) thyA
Type:
Enzyme
Mol. Mass.:
36576.54
Organism:
Lactobacillus casei
Description:
Residue:
316
  
Inhibitor
Name:
BDBM50016796
Synonyms:
CHEMBL3273852
Type:
Small organic molecule
Emp. Form.:
C27H30N8O5
Mol. Mass.:
546.5777
SMILES:
CN(CC1=Nc2c(N)nc(N)nc2N(Cc2ccccc2)C1)c1ccc(cc1)C(=O)N[C@@H](CCC(O)=O)C(O)=O
: