Target
Dihydrofolate reductase
Ligand
BDBM50016791
Substrate
Meas. Tech.
ChEMBL_1357878 (CHEMBL3285765)
IC50
200±n/a nM
Citation
 Chaykovsky, MHirst, MLazarus, HMartinelli, JE Methotrexate analogues. 9. Synthesis and biological properties of some 8-alkyl-7,8-dihydro analogues. J Med Chem 20:1323-7 (1977)  
Target
Name:
Dihydrofolate reductase
Synonyms:
DYR_LACCA folA
Type:
PROTEIN
Mol. Mass.:
18437.08
Organism:
Lactobacillus casei
Description:
ChEMBL_1357878
Residue:
163
  
Inhibitor
Name:
BDBM50016791
Synonyms:
CHEMBL3273855
Type:
Small organic molecule
Emp. Form.:
C20H26N8O5
Mol. Mass.:
458.471
SMILES:
CN(CC1CNc2nc(N)nc(N)c2N1)c1ccc(cc1)C(=O)N[C@@H](CCC(O)=O)C(O)=O
: