Target
Amine oxidase [flavin-containing] A
Ligand
BDBM50159254
Substrate
Meas. Tech.
ChEMBL_1363618 (CHEMBL3292881)
IC50
14800±n/a nM
Citation
 Legoabe, LJPetzer, APetzer, JP a-Tetralone derivatives as inhibitors of monoamine oxidase. Bioorg Med Chem Lett 24:2758-63 (2014)  
Target
Name:
Amine oxidase [flavin-containing] A
Synonyms:
AOFA_HUMAN MAO-A Monoamine oxidase Monoamine oxidase type A (MAO A) Monoamine oxidase type A (MAOA)
Type:
Protein
Mol. Mass.:
59689.53
Organism:
Homo sapiens (Human)
Description:
P21397
Residue:
527
  
Inhibitor
Name:
BDBM50159254
Synonyms:
3,4-Dihydro-2H-naphthalen-1-one CHEMBL193373
Type:
Small organic molecule
Emp. Form.:
C10H10O
Mol. Mass.:
146.1858
SMILES:
O=C1CCCc2ccccc12
: