Target
Amine oxidase [flavin-containing] B
Ligand
BDBM50017502
Substrate
Meas. Tech.
ChEMBL_1363619 (CHEMBL3292882)
IC50
11±n/a nM
Citation
 Legoabe, LJPetzer, APetzer, JP a-Tetralone derivatives as inhibitors of monoamine oxidase. Bioorg Med Chem Lett 24:2758-63 (2014)  
Target
Name:
Amine oxidase [flavin-containing] B
Synonyms:
AOFB_HUMAN MAOB Monoamine oxidase type B (MAO B) Monoamine oxidase type B (MAOB)
Type:
Protein
Mol. Mass.:
58768.76
Organism:
Homo sapiens (Human)
Description:
P27338
Residue:
520
  
Inhibitor
Name:
BDBM50017502
Synonyms:
CHEMBL3288302
Type:
Small organic molecule
Emp. Form.:
C18H15NO2
Mol. Mass.:
277.3172
SMILES:
O=C1CCCc2cc(OCc3ccc(cc3)C#N)ccc12
: