Target
Amine oxidase [flavin-containing] B
Ligand
BDBM50017512
Substrate
Meas. Tech.
ChEMBL_1363619 (CHEMBL3292882)
IC50
32±n/a nM
Citation
 Legoabe, LJPetzer, APetzer, JP a-Tetralone derivatives as inhibitors of monoamine oxidase. Bioorg Med Chem Lett 24:2758-63 (2014)  
Target
Name:
Amine oxidase [flavin-containing] B
Synonyms:
AOFB_HUMAN MAOB Monoamine oxidase type B (MAO B) Monoamine oxidase type B (MAOB)
Type:
Protein
Mol. Mass.:
58768.76
Organism:
Homo sapiens (Human)
Description:
P27338
Residue:
520
  
Inhibitor
Name:
BDBM50017512
Synonyms:
CHEMBL3288305
Type:
Small organic molecule
Emp. Form.:
C19H20O2
Mol. Mass.:
280.3609
SMILES:
O=C1CCCc2cc(OCCCc3ccccc3)ccc12
: