Target
Retinoic acid receptor RXR-alpha
Ligand
BDBM50018005
Substrate
Meas. Tech.
ChEMBL_1365627 (CHEMBL3297474)
Kd
10.0±n/a nM
Citation
 Atigadda, VRXia, GDesphande, ABoerma, LJLobo-Ruppert, SGrubbs, CJSmith, CDBrouillette, WJMuccio, DD Methyl substitution of a rexinoid agonist improves potency and reveals site of lipid toxicity. J Med Chem 57:5370-80 (2014)  
Target
Name:
Retinoic acid receptor RXR-alpha
Synonyms:
NR2B1 Nuclear receptor subfamily 4 group A member 2 RXRA Retinoic acid receptor RXR-alpha/gamma Retinoid receptor
Type:
PROTEIN
Mol. Mass.:
50820.38
Organism:
Homo sapiens (Human)
Description:
ChEMBL_1456363
Residue:
462
  
Inhibitor
Name:
BDBM50018005
Synonyms:
CHEMBL3289660
Type:
Small organic molecule
Emp. Form.:
C21H24O2
Mol. Mass.:
308.4141
SMILES:
C/C(/C=C/C=C(/C)\C=C1/CCCc2cccc(C)c12)=C\C(O)=O
: