Target
5-hydroxytryptamine receptor 7
Ligand
BDBM50018051
Substrate
Meas. Tech.
ChEMBL_1366807 (CHEMBL3297242)
Ki
0.100000±n/a nM
Citation
 Kolaczkowski, MMarcinkowska, MBucki, APawlowski, MMitka, KJaskowska, JKowalski, PKazek, GSiwek, AWasik, AWesolowska, AMierzejewski, PBienkowski, P Novel arylsulfonamide derivatives with 5-HT6/5-HT7 receptor antagonism targeting behavioral and psychological symptoms of dementia. J Med Chem 57:4543-57 (2014)  
Target
Name:
5-hydroxytryptamine receptor 7
Synonyms:
5-HT-7 5-HT7 5-HT7S 5HT7 HTR7 | Serotonin receptor 7
Type:
G Protein-Coupled Receptor (GPCR)
Mol. Mass.:
53573.08
Organism:
Homo sapiens (Human)
Description:
P34969
Residue:
479
  
Inhibitor
Name:
BDBM50018051
Synonyms:
CHEMBL3289972
Type:
Small organic molecule
Emp. Form.:
C21H24ClFN4O3S
Mol. Mass.:
466.957
SMILES:
Fc1ccc(cc1Cl)S(=O)(=O)NCCCCN1CCN(CC1)c1noc2ccccc12
: