Target
DNA gyrase subunit B
Ligand
BDBM50018407
Substrate
Meas. Tech.
ChEMBL_1361407 (CHEMBL3294031)
IC50
>100000±n/a nM
Citation
 Hameed P, SPatil, VSolapure, SSharma, UMadhavapeddi, PRaichurkar, AChinnapattu, MManjrekar, PShanbhag, GPuttur, JShinde, VMenasinakai, SRudrapatana, SAchar, VAwasthy, DNandishaiah, RHumnabadkar, VGhosh, ANarayan, CRamya, VKKaur, PSharma, SWerngren, JHoffner, SPanduga, VKumar, CNReddy, JKumar K N, MGanguly, SBharath, SBheemarao, UMukherjee, KArora, UGaonkar, SCoulson, MWaterson, DSambandamurthy, VKde Sousa, SM Novel N-linked aminopiperidine-based gyrase inhibitors with improved hERG and in vivo efficacy against Mycobacterium tuberculosis. J Med Chem 57:4889-905 (2014)  
Target
Name:
DNA gyrase subunit B
Synonyms:
GYRB_MYCSM | gyrB
Type:
PROTEIN
Mol. Mass.:
74505.25
Organism:
Mycobacterium smegmatis
Description:
ChEMBL_107961
Residue:
675
  
Inhibitor
Name:
BDBM50018407
Synonyms:
CHEMBL3290339
Type:
Small organic molecule
Emp. Form.:
C25H26N6O
Mol. Mass.:
426.5135
SMILES:
Cc1ncc(CNC2CCN(CCn3c4cc(ccc4ccc3=O)C#N)CC2)cc1C#N
: