Target
G-protein coupled bile acid receptor 1
Ligand
BDBM50019465
Substrate
Meas. Tech.
ChEMBL_1365357 (CHEMBL3292681)
EC50
85±n/a nM
Citation
 Zou, QDuan, HNing, MLiu, JFeng, YZhang, LZhu, JLeng, YShen, J 4-Benzofuranyloxynicotinamide derivatives are novel potent and orally available TGR5 agonists. Eur J Med Chem 82:1-15 (2014)  
Target
Name:
G-protein coupled bile acid receptor 1
Synonyms:
GPBAR_MOUSE M-BAR Tgr5
Type:
PROTEIN
Mol. Mass.:
35665.78
Organism:
Mus musculus
Description:
ChEMBL_1475560
Residue:
329
  
Inhibitor
Name:
BDBM50019465
Synonyms:
CHEMBL3290737
Type:
Small organic molecule
Emp. Form.:
C33H33ClN4O6
Mol. Mass.:
617.091
SMILES:
CCOC(=O)CNC(=O)CCc1oc2ccc(Cl)c(Oc3ccncc3C(=O)N3CCN(C4CC4)c4ccccc34)c2c1C
: