Target
G-protein coupled bile acid receptor 1
Ligand
BDBM50019466
Substrate
Meas. Tech.
ChEMBL_1365357 (CHEMBL3292681)
EC50
101±n/a nM
Citation
 Zou, QDuan, HNing, MLiu, JFeng, YZhang, LZhu, JLeng, YShen, J 4-Benzofuranyloxynicotinamide derivatives are novel potent and orally available TGR5 agonists. Eur J Med Chem 82:1-15 (2014)  
Target
Name:
G-protein coupled bile acid receptor 1
Synonyms:
GPBAR_MOUSE M-BAR Tgr5
Type:
PROTEIN
Mol. Mass.:
35665.78
Organism:
Mus musculus
Description:
ChEMBL_1475560
Residue:
329
  
Inhibitor
Name:
BDBM50019466
Synonyms:
CHEMBL3290736
Type:
Small organic molecule
Emp. Form.:
C29H26ClN3O5
Mol. Mass.:
531.987
SMILES:
Cc1c(CCC(O)=O)oc2ccc(Cl)c(Oc3ccncc3C(=O)N3CCN(C4CC4)c4ccccc34)c12
: