Target
G-protein coupled bile acid receptor 1
Ligand
BDBM50019489
Substrate
Meas. Tech.
ChEMBL_1365355 (CHEMBL3292679)
EC50
5.5±n/a nM
Citation
 Zou, QDuan, HNing, MLiu, JFeng, YZhang, LZhu, JLeng, YShen, J 4-Benzofuranyloxynicotinamide derivatives are novel potent and orally available TGR5 agonists. Eur J Med Chem 82:1-15 (2014)  
Target
Name:
G-protein coupled bile acid receptor 1
Synonyms:
BG37 GPBAR_HUMAN TGR5 hGPCR19
Type:
G Protein-Coupled Receptor (GPCR)
Mol. Mass.:
35260.02
Organism:
Homo sapiens (Human)
Description:
CHO cells transiently transfected with hTGR5.
Residue:
330
  
Inhibitor
Name:
BDBM50019489
Synonyms:
CHEMBL3290739
Type:
Small organic molecule
Emp. Form.:
C25H23N3O3
Mol. Mass.:
413.4684
SMILES:
CC(=O)c1cccc(Oc2ccncc2C(=O)N2CCN(C3CC3)c3ccccc23)c1
: