Target
G-protein coupled bile acid receptor 1
Ligand
BDBM50019495
Substrate
Meas. Tech.
ChEMBL_1365356 (CHEMBL3292680)
EC50
34±n/a nM
Citation
 Zou, QDuan, HNing, MLiu, JFeng, YZhang, LZhu, JLeng, YShen, J 4-Benzofuranyloxynicotinamide derivatives are novel potent and orally available TGR5 agonists. Eur J Med Chem 82:1-15 (2014)  
Target
Name:
G-protein coupled bile acid receptor 1
Synonyms:
BG37 GPBAR_HUMAN TGR5 hGPCR19
Type:
G Protein-Coupled Receptor (GPCR)
Mol. Mass.:
35260.02
Organism:
Homo sapiens (Human)
Description:
CHO cells transiently transfected with hTGR5.
Residue:
330
  
Inhibitor
Name:
BDBM50019495
Synonyms:
CHEMBL3290734
Type:
Small organic molecule
Emp. Form.:
C32H27ClN4O7
Mol. Mass.:
615.032
SMILES:
Cc1c(\C=C\C(=O)NCC(O)=O)oc2ccc(Cl)c(C(=O)Oc3ccncc3C(=O)N3CCN(C4CC4)c4ccccc34)c12
: