Target
G-protein coupled bile acid receptor 1
Ligand
BDBM50019501
Substrate
Meas. Tech.
ChEMBL_1365356 (CHEMBL3292680)
EC50
38±n/a nM
Citation
 Zou, QDuan, HNing, MLiu, JFeng, YZhang, LZhu, JLeng, YShen, J 4-Benzofuranyloxynicotinamide derivatives are novel potent and orally available TGR5 agonists. Eur J Med Chem 82:1-15 (2014)  
Target
Name:
G-protein coupled bile acid receptor 1
Synonyms:
BG37 GPBAR_HUMAN TGR5 hGPCR19
Type:
G Protein-Coupled Receptor (GPCR)
Mol. Mass.:
35260.02
Organism:
Homo sapiens (Human)
Description:
CHO cells transiently transfected with hTGR5.
Residue:
330
  
Inhibitor
Name:
BDBM50019501
Synonyms:
CHEMBL3290719
Type:
Small organic molecule
Emp. Form.:
C29H26ClN3O5
Mol. Mass.:
531.987
SMILES:
CCOC(=O)c1oc2cc(Cl)c(Oc3ccncc3C(=O)N3CCN(C4CC4)c4ccccc34)cc2c1C
: