Target
G-protein coupled bile acid receptor 1
Ligand
BDBM50019497
Substrate
Meas. Tech.
ChEMBL_1365357 (CHEMBL3292681)
EC50
52±n/a nM
Citation
 Zou, QDuan, HNing, MLiu, JFeng, YZhang, LZhu, JLeng, YShen, J 4-Benzofuranyloxynicotinamide derivatives are novel potent and orally available TGR5 agonists. Eur J Med Chem 82:1-15 (2014)  
Target
Name:
G-protein coupled bile acid receptor 1
Synonyms:
GPBAR_MOUSE M-BAR Tgr5
Type:
PROTEIN
Mol. Mass.:
35665.78
Organism:
Mus musculus
Description:
ChEMBL_1475560
Residue:
329
  
Inhibitor
Name:
BDBM50019497
Synonyms:
CHEMBL3290711
Type:
Small organic molecule
Emp. Form.:
C25H21N3O2S
Mol. Mass.:
427.518
SMILES:
O=C(N1CCN(C2CC2)c2ccccc12)c1cnccc1Oc1ccc2sccc2c1
: