Target
Intermediate conductance calcium-activated potassium channel protein 4
Ligand
BDBM50019902
Substrate
Meas. Tech.
ChEMBL_1361891 (CHEMBL3293066)
IC50
39±n/a nM
Citation
 Blass, B Fused Thiazin-3-ones as KCa3.1 Inhibitors. ACS Med Chem Lett 5:460-1 (2014)  
Target
Name:
Intermediate conductance calcium-activated potassium channel protein 4
Synonyms:
IK1 KCA4 KCNN4_HUMAN SK4
Type:
PROTEIN
Mol. Mass.:
47723.22
Organism:
Homo sapiens (Human)
Description:
ChEMBL_1361891
Residue:
427
  
Inhibitor
Name:
BDBM50019902
Synonyms:
CHEMBL3287207
Type:
Small organic molecule
Emp. Form.:
C15H11F4NO4S2
Mol. Mass.:
409.376
SMILES:
CC(N1c2sccc2S(=O)(=O)CC1=O)c1ccc(F)c(OC(F)(F)F)c1
: