Target
Intermediate conductance calcium-activated potassium channel protein 4
Ligand
BDBM50019905
Substrate
Meas. Tech.
ChEMBL_1361891 (CHEMBL3293066)
IC50
41±n/a nM
Citation
 Blass, B Fused Thiazin-3-ones as KCa3.1 Inhibitors. ACS Med Chem Lett 5:460-1 (2014)  
Target
Name:
Intermediate conductance calcium-activated potassium channel protein 4
Synonyms:
IK1 KCA4 KCNN4_HUMAN SK4
Type:
PROTEIN
Mol. Mass.:
47723.22
Organism:
Homo sapiens (Human)
Description:
ChEMBL_1361891
Residue:
427
  
Inhibitor
Name:
BDBM50019905
Synonyms:
CHEMBL3287210 | US9533999, ii-4
Type:
Small organic molecule
Emp. Form.:
C16H13F3N2OS
Mol. Mass.:
338.347
SMILES:
CC(N1C(=O)CSc2cccnc12)c1cccc(c1)C(F)(F)F
: