Target
Prostaglandin G/H synthase 1
Ligand
BDBM50019935
Substrate
Meas. Tech.
ChEMBL_1362991 (CHEMBL3292559)
IC50
46780±n/a nM
Citation
 Seth, KGarg, SKKumar, RPurohit, PMeena, VSGoyal, RBanerjee, UCChakraborti, AK 2-(2-Arylphenyl)benzoxazole As a Novel Anti-Inflammatory Scaffold: Synthesis and Biological Evaluation. ACS Med Chem Lett 5:512-6 (2014)  
Target
Name:
Prostaglandin G/H synthase 1
Synonyms:
COX1 Cyclooxygenase-1 (COX-1) PTGS1 | Prostaglandin G/H synthase (cyclooxygenase)
Type:
Protein
Mol. Mass.:
68868.60
Organism:
Ovis aries (Sheep)
Description:
Residue:
600
  
Inhibitor
Name:
BDBM50019935
Synonyms:
CHEMBL3287567
Type:
Small organic molecule
Emp. Form.:
C20H14ClNO2
Mol. Mass.:
335.784
SMILES:
COc1ccc(cc1Cl)-c1ccccc1-c1nc2ccccc2o1
: