Target
Prostaglandin G/H synthase 2
Ligand
BDBM50019935
Substrate
Meas. Tech.
ChEMBL_1362992 (CHEMBL3292560)
IC50
670±n/a nM
Citation
 Seth, KGarg, SKKumar, RPurohit, PMeena, VSGoyal, RBanerjee, UCChakraborti, AK 2-(2-Arylphenyl)benzoxazole As a Novel Anti-Inflammatory Scaffold: Synthesis and Biological Evaluation. ACS Med Chem Lett 5:512-6 (2014)  
Target
Name:
Prostaglandin G/H synthase 2
Synonyms:
COX2 Cyclooxygenase 2 (COX-2) Cyclooxygenase-2 (COX-2 AA) Cyclooxygenase-2 (COX-2) PGH2_HUMAN PHS II Prostaglandin E synthase/G/H synthase 2 Prostaglandin-endoperoxide synthase 2
Type:
Enzyme
Mol. Mass.:
69003.89
Organism:
Homo sapiens (Human)
Description:
Recombinant Cox-2 provided by Cayman (Cayman Chemical Co.,Ann Arbor, MI).
Residue:
604
  
Inhibitor
Name:
BDBM50019935
Synonyms:
CHEMBL3287567
Type:
Small organic molecule
Emp. Form.:
C20H14ClNO2
Mol. Mass.:
335.784
SMILES:
COc1ccc(cc1Cl)-c1ccccc1-c1nc2ccccc2o1
: