Target
Plasminogen
Ligand
BDBM50428067
Substrate
Meas. Tech.
ChEMBL_1363406 (CHEMBL3295541)
Kd
2200±n/a nM
Citation
 Cheng, LPettersen, DOhlsson, BSchell, PKarle, MEvertsson, EPahlén, SJonforsen, MPlowright, ATBoström, JFex, TThelin, AHilgendorf, CXue, YWahlund, GLindberg, WLarsson, LOGustafsson, D Discovery of the Fibrinolysis Inhibitor AZD6564, Acting via Interference of a Protein-Protein Interaction. ACS Med Chem Lett 5:538-43 (2014)  
Target
Name:
Plasminogen
Synonyms:
Activation peptide PLG Plasmin Plasmin heavy chain A, short form | Plasmin light chain B
Type:
Enzyme
Mol. Mass.:
90579.18
Organism:
Homo sapiens (Human)
Description:
Residue:
810
  
Inhibitor
Name:
BDBM50428067
Synonyms:
CL-65336 Lysteda Trans Amcha
Type:
Small organic molecule
Emp. Form.:
C8H15NO2
Mol. Mass.:
157.2102
SMILES:
NC[C@H]1CC[C@@H](CC1)C(O)=O
: