Target
Diacylglycerol O-acyltransferase 1
Ligand
BDBM50385398
Substrate
Meas. Tech.
ChEMBL_1363771 (CHEMBL3294188)
IC50
36±n/a nM
Citation
 Zhou, GZorn, NTing, PAslanian, RLin, MCook, JLachowicz, JLin, ASmith, MHwa, Jvan Heek, MWalker, S Development of novel benzomorpholine class of diacylglycerol acyltransferase I inhibitors. ACS Med Chem Lett 5:544-9 (2014)  
Target
Name:
Diacylglycerol O-acyltransferase 1
Synonyms:
ACAT-related gene product 1 Acyl coA-diacylglycerol acyl transferase 1 (DGAT1) DGAT1 Diacylglycerol Acyltransferase (DGAT1) Diacylglycerol O-acyltransferase 1 (DGAT1) | Diglyceride acyltransferase
Type:
Protein
Mol. Mass.:
55297.82
Organism:
Homo sapiens (Human)
Description:
O75907
Residue:
488
  
Inhibitor
Name:
BDBM50385398
Synonyms:
CHEMBL2036730
Type:
Small organic molecule
Emp. Form.:
C23H22F2N4O4
Mol. Mass.:
456.442
SMILES:
OC(=O)C[C@H]1CC[C@@H](CC1)c1ccc(NC(=O)c2nnc(Nc3ccc(F)c(F)c3)o2)cc1
: