Target
Chloroquine resistance transporter
Ligand
BDBM50020154
Substrate
Meas. Tech.
ChEMBL_1364181 (CHEMBL3292896)
IC50
321000±n/a nM
Citation
 Deane, KJSummers, RLLehane, AMMartin, REBarrow, RA Chlorpheniramine Analogues Reverse Chloroquine Resistance in Plasmodium falciparum by Inhibiting PfCRT. ACS Med Chem Lett 5:576-81 (2014)  
Target
Name:
Chloroquine resistance transporter
Synonyms:
CRT PfCRT
Type:
PROTEIN
Mol. Mass.:
48687.29
Organism:
Plasmodium falciparum
Description:
ChEMBL_1364181
Residue:
424
  
Inhibitor
Name:
BDBM50020154
Synonyms:
CHEMBL3288452
Type:
Small organic molecule
Emp. Form.:
C18H21ClN2
Mol. Mass.:
300.826
SMILES:
CCN(CC)C\C=C(/c1ccc(Cl)cc1)c1ccccn1
: