Target
Cannabinoid receptor 2
Ligand
BDBM50020600
Substrate
Meas. Tech.
ChEMBL_1361903 (CHEMBL3293299)
Ki
2.5±n/a nM
Citation
 Pinna, GLoriga, GLazzari, PRuiu, SFalzoi, MFrau, SPau, AMurineddu, GAsproni, BPinna, GA Tricyclic pyrazoles. Part 6. Benzofuro[3,2-c]pyrazole: a versatile architecture for CB2 selective ligands. Eur J Med Chem 82:281-92 (2014)  
Target
Name:
Cannabinoid receptor 2
Synonyms:
CANNABINOID CB2 CB2 Cannabinoid CB2 receptor Cannabinoid receptor 2 mCB2
Type:
Enzyme Catalytic Domain
Mol. Mass.:
38220.43
Organism:
MOUSE
Description:
P47936
Residue:
347
  
Inhibitor
Name:
BDBM50020600
Synonyms:
CHEMBL3290450
Type:
Small organic molecule
Emp. Form.:
C27H27Cl2N3O2
Mol. Mass.:
496.428
SMILES:
Cc1ccc2c(c1)oc1c(nn(-c3ccc(Cl)cc3Cl)c21)C(=O)N[C@H]1C2(C)CCC(C2)C1(C)C
: