Target
Kappa-type opioid receptor
Ligand
BDBM50020711
Substrate
Meas. Tech.
ChEMBL_1363048 (CHEMBL3293117)
Ki
0.080000±n/a nM
Citation
 Schoultz, BWHjørnevik, TReed, BJMarton, JCoello, CSWilloch, FHenriksen, G Synthesis and evaluation of three structurally related¹8F-labeled orvinols of different intrinsic activities: 6-O-[¹8F]fluoroethyl-diprenorphine ([¹8F]FDPN), 6-O-[¹8F]fluoroethyl-buprenorphine ([¹8F]FBPN), and 6-O-[¹8F]fluoroethyl-phenethyl-orvinol ([¹8F]FPEO). J Med Chem 57:5464-9 (2014)  
Target
Name:
Kappa-type opioid receptor
Synonyms:
K-OR-1 Kappa-opioid receptor (KOR) Kappa-type opioid receptor (KOR) OPIATE Kappa OPRK1 kappa opioid receptor (KOR)
Type:
G Protein-Coupled Receptor (GPCR)
Mol. Mass.:
42648.76
Organism:
Homo sapiens (Human)
Description:
P41145
Residue:
380
  
Inhibitor
Name:
BDBM50020711
Synonyms:
CHEMBL3291216
Type:
Small organic molecule
Emp. Form.:
C31H36FNO4
Mol. Mass.:
505.6202
SMILES:
[H][C@@]12Oc3c4c(C[C@@]5([H])N(C)CC[C@@]14[C@]51C[C@]([H])([C@@](C)(O)CCc4ccccc4)[C@@]2(OCCF)C=C1)ccc3O
: