Target
Amyloid-beta precursor protein
Ligand
BDBM50020860
Substrate
Meas. Tech.
ChEMBL_1364643 (CHEMBL3291776)
IC50
32±n/a nM
Citation
 Blass, B Imidazo[2,1]thiazol-3-one Derivatives Useful as Diagnostic Agents for Alzheimer's Disease. ACS Med Chem Lett 5:619-20 (2014)  
Target
Name:
Amyloid-beta precursor protein
Synonyms:
A4 ABPP AICD-50 AICD-59 AID(57) APP Alzheimer disease amyloid protein Amyloid beta Protein Amyloid beta protein Abeta(1-42) Amyloid intracellular domain 57 Amyloid protein (Abeta42b) Beta amyloid A4 protein Beta-APP42 Beta-amyloid protein 42 C83 CVAP Gamma Secretase Gamma-CTF(57) Gamma-secretase Gamma-secretase C-terminal fragment 57 P3(40) PN-II Protease nexin-II S-APP-beta Soluble APP-beta | beta-Amyloid Precursor Protein (APP)
Type:
Single-pass type I membrane protein
Mol. Mass.:
86890.41
Organism:
Homo sapiens (Human)
Description:
P05067
Residue:
770
  
Inhibitor
Name:
BDBM50020860
Synonyms:
CHEMBL3286983
Type:
Small organic molecule
Emp. Form.:
C19H12Cl2N2O3S
Mol. Mass.:
419.281
SMILES:
COc1cc(\C=c2/sc3nc(cn3c2=O)-c2ccc(Cl)cc2)cc(Cl)c1O
: