Target
D(3) dopamine receptor
Ligand
BDBM123850
Substrate
Meas. Tech.
ChEMBL_1365040 (CHEMBL3291796)
Ki
1.9±n/a nM
Citation
 Kumar, VBanala, AKGarcia, EGCao, JKeck, TMBonifazi, ADeschamps, JRNewman, AH Chiral Resolution and Serendipitous Fluorination Reaction for the Selective Dopamine D3 Receptor Antagonist BAK2-66. ACS Med Chem Lett 5:647-51 (2014)  
Target
Name:
D(3) dopamine receptor
Synonyms:
DOPAMINE D3 DRD3_HUMAN Dopamine D3 receptor (D3) Dopamine receptor Dopamine receptor D3
Type:
Mol. Mass.:
44243.43
Organism:
Homo sapiens (Human)
Description:
Residue:
400
  
Inhibitor
Name:
BDBM123850
Synonyms:
US8748608, 34 US8748608, 34 Enantiomer B
Type:
Small organic molecule
Emp. Form.:
C23H26Cl2N4O2
Mol. Mass.:
461.384
SMILES:
OC(CCNC(=O)c1cc2ccccc2[nH]1)CN1CCN(CC1)c1cccc(Cl)c1Cl
: