Target
RAC-alpha serine/threonine-protein kinase
Ligand
BDBM50022565
Substrate
Meas. Tech.
ChEMBL_1368413 (CHEMBL870503)
IC50
>100000±n/a nM
Citation
 Nguyen, TCoover, RAVerghese, JMoran, RGEllis, KC Phenylalanine-Based Inactivator of AKT Kinase: Design, Synthesis, and Biological Evaluation. ACS Med Chem Lett 5:462-7 (2014)  
Target
Name:
RAC-alpha serine/threonine-protein kinase
Synonyms:
AKT phosphorylation (p-AKT) AKT1/PPP1CA C-AKT PKB alpha Protein kinase B Protein kinase B (Akt 1) Protein kinase B alpha Proto-oncogene Akt (Akt1) Proto-oncogene c-Akt (AKT1) RAC-PK-alpha RAC-alpha serine/threonine-protein kinase (AKT1) | RAC-alpha serine/threonine-protein kinase (pAKT)
Type:
Enzyme
Mol. Mass.:
55681.25
Organism:
Homo sapiens (Human)
Description:
P31749
Residue:
480
  
Inhibitor
Name:
BDBM50022565
Synonyms:
CHEMBL3298930
Type:
Small organic molecule
Emp. Form.:
C16H23NO3
Mol. Mass.:
277.3587
SMILES:
CCC(=O)C(Cc1ccccc1)NC(=O)OC(C)(C)C
: