Target
Bcl-2-like protein 1
Ligand
BDBM50022566
Substrate
Meas. Tech.
ChEMBL_1368720
Ki
>100000±n/a nM
Citation
 Apel, CGény, CDumontet, VBirlirakis, NRoussi, FPham, VCDoan Thi Mai, HNguyen, VHChau, VMLitaudon, M Endiandric acid analogues from Beilschmiedia ferruginea as dual inhibitors of Bcl-xL/Bak and Mcl-1/Bid interactions. J Nat Prod 77:1430-7 (2014)  
Target
Name:
Bcl-2-like protein 1
Synonyms:
Anti-apoptotic Bcl-2 protein Apoptosis regulator Bcl-X BCL2-like 1 isoform 1 BCL2L1 Bcl-2-like protein 1 (Bcl-XL) Bcl-xL/Bcl-2-binding component 3 Bcl2-antagonist of cell death (BAD)
Type:
Mitochondrion membrane; Single-pass membrane protein
Mol. Mass.:
26039.60
Organism:
Homo sapiens (Human)
Description:
Residue:
233
  
Inhibitor
Name:
BDBM50022566
Synonyms:
CHEMBL3298851
Type:
Small organic molecule
Emp. Form.:
C23H26O3
Mol. Mass.:
350.4507
SMILES:
[H][C@]12C[C@@]3([H])C=C[C@@H](C(O)=O)[C@]4([H])C=C[C@]([H])([C@H]1CCCc1ccc(O)cc1)[C@@]2([H])[C@]34[H]
: