Target
Induced myeloid leukemia cell differentiation protein Mcl-1
Ligand
BDBM50022568
Substrate
Meas. Tech.
ChEMBL_1368722
Ki
13000±n/a nM
Citation
 Apel, CGény, CDumontet, VBirlirakis, NRoussi, FPham, VCDoan Thi Mai, HNguyen, VHChau, VMLitaudon, M Endiandric acid analogues from Beilschmiedia ferruginea as dual inhibitors of Bcl-xL/Bak and Mcl-1/Bid interactions. J Nat Prod 77:1430-7 (2014)  
Target
Name:
Induced myeloid leukemia cell differentiation protein Mcl-1
Synonyms:
BCL2L3 Bcl-2-like protein 3 (Mcl-1) Bcl2-L-3 MCL1 Mcl-1 Myeloid cell leukemia sequence 1 (BCL2-related) | mcl1/EAT
Type:
Membrane; Single-pass membrane protein
Mol. Mass.:
37332.87
Organism:
Homo sapiens (Human)
Description:
Q07820
Residue:
350
  
Inhibitor
Name:
BDBM50022568
Synonyms:
CHEMBL3298853
Type:
Small organic molecule
Emp. Form.:
C27H34O3
Mol. Mass.:
406.5571
SMILES:
[H][C@]12C[C@@]3([H])C=C[C@@H](C(O)=O)[C@]4([H])C=C[C@]([H])([C@H]1CCCCCCCc1ccc(O)cc1)[C@@]2([H])[C@]34[H]
: