Target
High affinity nerve growth factor receptor
Ligand
BDBM50022672
Substrate
Meas. Tech.
ChEMBL_1368858 (CHEMBL3299480)
IC50
47±n/a nM
Citation
 Stachel, SJSanders, JMHenze, DARudd, MTSu, HPLi, YNanda, KKEgbertson, MSManley, PJJones, KLBrnardic, EJGreen, AGrobler, JAHanney, BLeitl, MLai, MTMunshi, VMurphy, DRickert, KRiley, DKrasowska-Zoladek, ADaley, CZuck, PKane, SABilodeau, MT Maximizing diversity from a kinase screen: identification of novel and selective pan-Trk inhibitors for chronic pain. J Med Chem 57:5800-16 (2014)  
Target
Name:
High affinity nerve growth factor receptor
Synonyms:
2.7.10.1 NTRK1 NTRK1_HUMAN Neurotrophic tyrosine kinase receptor type 1 Synonyms=MTC TRK1-transforming tyrosine kinase protein TRKA GN Trk-A Tropomyosin-related kinase A Tyrosine kinase receptor Tyrosine kinase receptor A Tyrosine kinase receptor A (Trk-A) gp140trk | p140-TrkA
Type:
Mol. Mass.:
87498.18
Organism:
Homo sapiens (Human)
Description:
P04629
Residue:
796
  
Inhibitor
Name:
BDBM50022672
Synonyms:
CHEMBL3298266
Type:
Small organic molecule
Emp. Form.:
C27H26N8O2
Mol. Mass.:
494.5477
SMILES:
COc1cc(ccc1-n1cnc(C)c1)-c1cn(CC(=O)Nc2cc(nn2-c2ccccc2)C2CC2)nn1
: