Target
Stromelysin-1
Ligand
BDBM50025159
Substrate
Meas. Tech.
ChEMBL_1442063 (CHEMBL3373431)
IC50
>10000±n/a nM
Citation
 Nara, HSato, KNaito, TMototani, HOki, HYamamoto, YKuno, HSantou, TKanzaki, NTerauchi, JUchikawa, OKori, M Thieno[2,3-d]pyrimidine-2-carboxamides bearing a carboxybenzene group at 5-position: highly potent, selective, and orally available MMP-13 inhibitors interacting with the S1¿ binding site. Bioorg Med Chem 22:5487-505 (2014)  
Target
Name:
Stromelysin-1
Synonyms:
MMP-3 MMP3_HUMAN Matrix metalloproteinase 3 Matrix metalloproteinase-3 (MMP-3) SL-1 Stromelysin 1 | Transin-1
Type:
Enzyme
Mol. Mass.:
53973.13
Organism:
Homo sapiens (Human)
Description:
P08254
Residue:
477
  
Inhibitor
Name:
BDBM50025159
Synonyms:
CHEMBL3337869
Type:
Small organic molecule
Emp. Form.:
C17H15N3O3
Mol. Mass.:
309.3193
SMILES:
COc1cccc(CNC(=O)c2nc3ccccc3c(=O)[nH]2)c1
: