Target
Lipoxygenase
Ligand
BDBM50025851
Substrate
Meas. Tech.
ChEMBL_1437404 (CHEMBL3386626)
IC50
60500±n/a nM
Citation
 Pavic, KPerkovic, ICindric, MPranjic, MMartin-Kleiner, IKralj, MSchols, DHadjipavlou-Litina, DKatsori, AMZorc, B Novel semicarbazides and ureas of primaquine with bulky aryl or hydroxyalkyl substituents: synthesis, cytostatic and antioxidative activity. Eur J Med Chem 86:502-14 (2014)  
Target
Name:
Lipoxygenase
Synonyms:
Type:
PROTEIN
Mol. Mass.:
1886.07
Organism:
Glycine max
Description:
ChEMBL_103841
Residue:
18
PNSEEGLTCRGIPNSISI
  
Inhibitor
Name:
BDBM50025851
Synonyms:
CHEMBL3329237
Type:
Small organic molecule
Emp. Form.:
C31H35N7O4
Mol. Mass.:
569.6541
SMILES:
COc1ccc(cc1)C(=N\NC(=O)NNC(=O)NCCCC(C)Nc1cc(OC)cc2cccnc12)\c1ccccc1
: