Target
Neuronal acetylcholine receptor subunit alpha-7
Ligand
BDBM50027489
Substrate
Meas. Tech.
ChEMBL_1442973 (CHEMBL3378918)
EC50
7300±n/a nM
Citation
 Balsera, BMulet, JFernández-Carvajal, Ade la Torre-Martínez, RFerrer-Montiel, AHernández-Jiménez, JGEstévez-Herrera, JBorges, RFreitas, AELópez, MGGarcía-López, MTGonzález-Muńiz, RPérez de Vega, MJValor, LMSvobodová, LSala, SSala, FCriado, M Chalcones as positive allosteric modulators ofa7 nicotinic acetylcholine receptors: a new target for a privileged structure. Eur J Med Chem 86:724-39 (2014)  
Target
Name:
Neuronal acetylcholine receptor subunit alpha-7
Synonyms:
ACHA7_HUMAN Cholinergic, Nicotinic Alpha7 Neuronal acetylcholine receptor protein alpha-7 subunit Nicotinic acetylcholine receptor alpha-7 (alpha7 nAChR)
Type:
Mol. Mass.:
56448.33
Organism:
Homo sapiens (Human)
Description:
CHRNA7 (NACHRA7)
Residue:
502
  
Inhibitor
Name:
BDBM50027489
Synonyms:
CHEMBL3335597
Type:
Small organic molecule
Emp. Form.:
C19H20O5
Mol. Mass.:
328.3591
SMILES:
COc1ccc(\C=C\C(=O)c2ccc(O)cc2C)c(OC)c1OC
: