Target
Mu-type opioid receptor
Ligand
BDBM50029110
Substrate
Meas. Tech.
ChEMBL_1436242 (CHEMBL3387189)
Ki
>5000±n/a nM
Citation
 Journigan, VBMésangeau, CVyas, NEans, SOCutler, SJMcLaughlin, JPMollereau, CMcCurdy, CR Nonpeptide small molecule agonist and antagonist original leads for neuropeptide FF1 and FF2 receptors. J Med Chem 57:8903-27 (2014)  
Target
Name:
Mu-type opioid receptor
Synonyms:
M-OR-1 MOR-1 MUOR1 Mu opiate receptor OPRM1 hMOP | mu-type opioid receptor isoform MOR-1
Type:
G Protein-Coupled Receptor (GPCR)
Mol. Mass.:
44789.51
Organism:
Homo sapiens (Human)
Description:
P35372
Residue:
400
  
Inhibitor
Name:
BDBM50029110
Synonyms:
CHEMBL3361423
Type:
Small organic molecule
Emp. Form.:
C23H31N5O
Mol. Mass.:
393.5251
SMILES:
NC(=N)NCC(=O)NCC1(Cc2ccccc2)CCN(Cc2ccccc2)CC1
: