Target
Broad substrate specificity ATP-binding cassette transporter ABCG2
Ligand
BDBM50029900
Substrate
Meas. Tech.
ChEMBL_1437665 (CHEMBL3381155)
IC50
610±n/a nM
Citation
 Jabor Gozzi, GBouaziz, ZWinter, EDaflon-Yunes, NAichele, DNacereddine, AMarminon, CValdameri, GZeinyeh, WBollacke, AGuillon, JLacoudre, APinaud, NCadena, SMJose, JLe Borgne, MDi Pietro, A Converting potent indeno[1,2-b]indole inhibitors of protein kinase CK2 into selective inhibitors of the breast cancer resistance protein ABCG2. J Med Chem 58:265-77 (2015)  
Target
Name:
Broad substrate specificity ATP-binding cassette transporter ABCG2
Synonyms:
ABCG2 ABCP ATP-binding cassette sub-family G member 2 ATP-binding cassette, sub-family G, member 2 BCRP1 CDw338 Mitoxantrone resistance-associated protein Urate exporter
Type:
Multi-pass membrane protein; monomer or homodimer; disulfide-linked
Mol. Mass.:
72329.48
Organism:
Homo sapiens (Human)
Description:
Q9UNQ0
Residue:
655
  
Inhibitor
Name:
BDBM50029900
Synonyms:
CHEMBL3353422
Type:
Small organic molecule
Emp. Form.:
C32H29NO2
Mol. Mass.:
459.5782
SMILES:
CC(C)n1c2CCC(Cc3ccccc3)(Cc3ccccc3)C(=O)c2c2C(=O)c3ccccc3-c12
: