Target
Broad substrate specificity ATP-binding cassette transporter ABCG2
Ligand
BDBM50305083
Substrate
Meas. Tech.
ChEMBL_1437665 (CHEMBL3381155)
IC50
90±n/a nM
Citation
 Jabor Gozzi, GBouaziz, ZWinter, EDaflon-Yunes, NAichele, DNacereddine, AMarminon, CValdameri, GZeinyeh, WBollacke, AGuillon, JLacoudre, APinaud, NCadena, SMJose, JLe Borgne, MDi Pietro, A Converting potent indeno[1,2-b]indole inhibitors of protein kinase CK2 into selective inhibitors of the breast cancer resistance protein ABCG2. J Med Chem 58:265-77 (2015)  
Target
Name:
Broad substrate specificity ATP-binding cassette transporter ABCG2
Synonyms:
ABCG2 ABCP ATP-binding cassette sub-family G member 2 ATP-binding cassette, sub-family G, member 2 BCRP1 CDw338 Mitoxantrone resistance-associated protein Urate exporter
Type:
Multi-pass membrane protein; monomer or homodimer; disulfide-linked
Mol. Mass.:
72329.48
Organism:
Homo sapiens (Human)
Description:
Q9UNQ0
Residue:
655
  
Inhibitor
Name:
BDBM50305083
Synonyms:
3-((3S,6S)-6-Isobutyl-9-methoxy-1,4-dioxo-1,2,3,4,6,7,12,12a-octahydro-pyrazino[1',2':1,6]pyrido[3,4-b]indol-3-yl)-propionic acid tert-butyl ester CHEMBL488910 Ko143 | US9695174, Ko143
Type:
Small organic molecule
Emp. Form.:
C26H35N3O5
Mol. Mass.:
469.5732
SMILES:
COc1ccc2c3C[C@@H]4N([C@@H](CC(C)C)c3[nH]c2c1)C(=O)[C@H](CCC(=O)OC(C)(C)C)NC4=O
: