Target
D(1A) dopamine receptor
Ligand
BDBM50030483
Substrate
Meas. Tech.
ChEMBL_1435673 (CHEMBL3387734)
Ki
133±n/a nM
Citation
 Li, ZHuang, JSun, HZhou, SGuo, LZhou, YZhen, XLiu, H Design, synthesis and evaluation of benzo[a]thieno[3,2-g]quinolizines as novel l-SPD derivatives possessing dopamine D1, D2 and serotonin 5-HT1A multiple action profiles. Bioorg Med Chem 22:5838-46 (2014)  
Target
Name:
D(1A) dopamine receptor
Synonyms:
DA D1 receptor DRD1 Dopamine D1 receptor Dopamine D1A
Type:
Enzyme
Mol. Mass.:
49303.43
Organism:
Homo sapiens (Human)
Description:
P21728
Residue:
446
  
Inhibitor
Name:
BDBM50030483
Synonyms:
CHEMBL3344460
Type:
Small organic molecule
Emp. Form.:
C21H27NO2S
Mol. Mass.:
357.51
SMILES:
[H][C@@]12Cc3sc(CCCCC)cc3CN1CCc1cc(OC)c(O)cc21
: