Target
D(1A) dopamine receptor
Ligand
BDBM50378584
Substrate
Meas. Tech.
ChEMBL_1435673 (CHEMBL3387734)
Ki
12±n/a nM
Citation
 Li, ZHuang, JSun, HZhou, SGuo, LZhou, YZhen, XLiu, H Design, synthesis and evaluation of benzo[a]thieno[3,2-g]quinolizines as novel l-SPD derivatives possessing dopamine D1, D2 and serotonin 5-HT1A multiple action profiles. Bioorg Med Chem 22:5838-46 (2014)  
Target
Name:
D(1A) dopamine receptor
Synonyms:
DA D1 receptor DRD1 Dopamine D1 receptor Dopamine D1A
Type:
Enzyme
Mol. Mass.:
49303.43
Organism:
Homo sapiens (Human)
Description:
P21728
Residue:
446
  
Inhibitor
Name:
BDBM50378584
Synonyms:
STEPHOLIDINE
Type:
Small organic molecule
Emp. Form.:
C19H21NO4
Mol. Mass.:
327.3743
SMILES:
COc1cc2CCN3Cc4c(C[C@H]3c2cc1O)ccc(O)c4OC
: